{"text_format":"1","workbook":"xlsx","n_sheets":14,"sheets":["School Information","Paper purchased","How much waste","What's in your waste","Waste Minimisation","DataStore","Additional Constants","Waste Composition","Recommendation List","Report One","Report Two","Report Three","Report Four","Report Five"],"not_rendered":{"charts":5,"images":31,"macros":1,"external_links":0,"defined_names":18,"comments":0,"pivot_tables":0},"unopened":[],"bounds":{"document_bytes":16777216,"sheet_cells":100000,"rows_first":2000,"rows_last":500,"rows_between":2000,"halvings":0,"cell_chars":16384,"cell_head_chars":4096},"cells_cut":0,"cells_raw":0,"read":"whole","date_system":"1900"}

{"sheet":"School Information","index":0,"n_rows":10,"n_cols":9,"rows_kept":10,"cut":false,"hidden":false,"merged":[[8,3,8,13],[9,3,9,13],[0,2,0,13],[3,3,3,13],[5,3,5,13],[6,3,6,13]]}
[null,null,"School Waste Calculator"]
[null,null,null,null,null,null,null,null,"page 1 of 5"]
[]
[null,null,"School Name"]
[]
[null,null,"Number of Students"]
[null,null,"Number of Staff"]
[]
[null,null,"State or Teritory","NSW"]
[null,null,"Local Government Area"]
{"$rows_left_out":1}
{"sheet":"Paper purchased","index":1,"n_rows":16,"n_cols":18,"rows_kept":16,"cut":false,"hidden":false,"merged":[[0,2,0,13],[3,2,3,13],[6,3,6,11],[8,3,8,11],[5,3,5,11]]}
[null,null,"School Waste Calculator",null,null,null,null,null,null,null,null,null,null,null,null,null,"Explanation - Delete when happy"]
[null,null,null,null,null,null,null,null,"page 2 of 5"]
[]
[null,null,"Paper Purchases"]
[]
[null,null,"Number of Reams A4",null,null,null,null,null,null,null,null,null,null,null,null,null," to be multiplied by 2.5 to give KG"]
[null,null,"Over What Period",null,null,null,null,null,null,null,null,null,null,null,null,null,"to allow for period calculation"]
[]
[null,null,"Recycled Content (%)",null,null,null,null,null,null,null,null,null,null,null,null,null,"to modify the footprint and consider alternatives"]
[]
{"$rows_left_out":7}
{"sheet":"How much waste","index":2,"n_rows":141,"n_cols":22,"rows_kept":141,"cut":false,"hidden":false,"merged":[[120,14,122,16],[121,6,121,8],[122,9,122,10],[121,9,121,10],[45,15,45,17],[57,11,57,13],[57,15,57,17],[60,7,60,9],[60,11,60,13],[60,15,60,17],[54,7,54,9],[54,11,54,13],[62,15,62,17],[57,7,57,9],[140,4,143,17],[98,4,100,17],[64,7,64,9],[64,11,64,13],[64,15,64,17],[66,7,66,9],[66,11,66,13],[66,15,66,17],[130,4,132,4],[130,6,130,8],[130,9,130,10],[139,4,139,11],[128,6,128,8],[128,9,128,10],[128,14,130,16],[129,6,129,8],[122,6,122,8],[111,4,116,4],[112,6,112,7],[115,6,115,7],[129,9,129,10],[120,4,124,4],[120,6,120,8],[120,9,120,10],[17,15,17,17],[19,7,19,9],[19,11,19,13],[19,15,19,17],[21,7,21,9],[21,11,21,13],[21,15,21,17],[23,7,23,9],[23,11,23,13],[23,15,23,17],[25,15,25,17],[27,7,27,9],[27,11,27,13],[37,7,37,9],[37,11,37,13],[52,7,52,9],[52,11,52,13],[52,15,52,17],[27,15,27,17],[35,15,35,17],[29,7,29,9],[29,15,29,17],[31,7,31,9],[31,11,31,13],[31,15,31,17],[33,15,33,17],[37,15,37,17],[50,15,50,17],[39,3,39,5],[39,7,39,9],[39,11,39,13],[39,15,39,17],[41,7,41,9],[41,11,41,13],[41,15,41,17],[54,15,54,17],[48,7,48,9],[48,11,48,13],[48,15,48,17],[43,15,43,17],[45,7,45,9],[45,11,45,13],[0,2,0,19],[7,7,7,9],[7,11,7,13],[7,15,7,17],[3,2,3,19],[86,4,88,4],[13,15,13,17],[19,3,19,5],[15,15,15,17],[17,7,17,9],[73,4,73,13],[9,3,9,5],[74,4,77,17],[5,7,5,9],[5,11,5,13],[5,15,5,17],[35,7,35,9],[35,11,35,13],[13,11,13,13],[15,7,15,9],[15,11,15,13],[9,15,9,17],[11,15,11,17],[9,7,9,9],[9,11,9,13],[11,7,11,9],[11,11,11,13],[13,7,13,9],[102,4,107,4],[102,10,102,12],[103,6,103,7],[105,6,105,7],[107,6,107,7],[29,3,29,5],[33,7,33,9],[33,11,33,13],[50,3,50,5],[50,7,50,9],[50,11,50,13],[43,7,43,9],[43,11,43,13],[62,3,62,5],[62,7,62,9],[62,11,62,13],[25,7,25,9],[25,11,25,13],[17,11,17,13],[29,11,29,13]]}
[null,null,"School Waste Calculator"]
[null,null,null,null,null,null,null,null,null,null,null,null,null,null,"page 3 of 5"]
[]
[null,null,"How Much Waste \n(see tips at bottom of page)"]
[]
[null,null,null,null,"General Waste (garbage to landfill)",null,null,"Bin Type One",null,null,null,"Bin Type Two",null,null,null,"Bin Type Three"]
[]
[null,null,null,"Bin Size (in cubic meters)",null,null,null,null,null,null,null,null,null,null,null,null,null,null,null,null,null,{"$f":"IF(OR(H15,L15,P15),TRUE,FALSE)","v":false}]
[]
[null,null,null,"How many times per week is it collected"]
{"$rows_left_out":132}
{"sheet":"What's in your waste","index":3,"n_rows":31,"n_cols":36,"rows_kept":31,"cut":false,"hidden":false,"merged":[[29,4,29,16],[15,3,15,4],[23,5,23,6],[23,7,23,8],[23,13,23,14],[23,16,23,17],[19,9,19,10],[19,11,19,12],[23,21,23,22],[21,5,21,6],[21,7,21,8],[21,13,21,14],[21,16,21,17],[21,18,21,19],[21,21,21,22],[23,18,23,19],[21,9,21,10],[21,11,21,12],[9,9,9,10],[9,11,9,12],[19,21,19,22],[17,5,17,6],[17,7,17,8],[17,13,17,14],[17,16,17,17],[17,18,17,19],[17,21,17,22],[19,5,19,6],[19,7,19,8],[19,13,19,14],[19,16,19,17],[19,18,19,19],[17,9,17,10],[17,11,17,12],[0,2,0,24],[7,5,7,6],[7,7,7,8],[7,13,7,14],[7,16,7,17],[7,18,7,19],[7,21,7,22],[7,9,7,10],[7,11,7,12],[3,2,3,25],[11,9,11,10],[11,11,11,12],[30,4,33,22],[9,5,9,6],[11,5,11,6],[9,7,9,8],[11,7,11,8],[9,13,9,14],[11,13,11,14],[11,21,11,22],[9,16,9,17],[11,16,11,17],[9,18,9,19],[13,4,13,22],[9,21,9,22],[11,18,11,19]]}
[null,null,"School Waste Calculator"]
[null,null,null,null,null,null,null,null,null,null,null,null,null,null,null,null,null,null,null,"page 4 of 5"]
[]
[null,null,"What's in Your Waste \n(see tips at bottom of page)"]
[]
[null,null,null,"Waste Stream",null,"Recyclable Paper",null,"Cardboard",null,"Recyclable Glass",null,"Recyclable Plastic",null,"Recyclable Metal",null,null,"Food Waste",null,"Garden waste",null,null,"General Waste"]
[]
[null,null,null,null,"General Waste",{"$f":"AC8","v":0.42},null,{"$f":"AD8","v":0.21},null,{"$f":"AE8","v":0},null,{"$f":"AF8","v":0.05},null,{"$f":"AG8","v":0.01},null,null,{"$f":"AH8","v":0.04},null,{"$f":"AI8","v":0.09},null,null,{"$f":"AJ8","v":0.19},null,null,null,null,null,{"$f":"IF(OR(SUM(F8:W8)=1,SUM(F8:W8)=0),TRUE,FALSE)","v":false},{"$f":"'Waste Composition'!C86","v":0.42},{"$f":"'Waste Composition'!D86","v":0.21},{"$f":"'Waste Composition'!E86","v":0},{"$f":"'Waste Composition'!F86","v":0.05},{"$f":"'Waste Composition'!G86","v":0.01},{"$f":"'Waste Composition'!H86","v":0.04},{"$f":"'Waste Composition'!I86","v":0.09},{"$f":"'Waste Composition'!J86","v":0.19}]
[null,null,null,null,null,null,null,null,null,null,null,null,null,null,null,null,null,null,null,null,null,null,null,null,null,null,null,null,{"$f":"'Waste Composition'!C87","v":0.65},{"$f":"'Waste Composition'!D87","v":0.19},{"$f":"'Waste Composition'!E87","v":0},{"$f":"'Waste Composition'!F87","v":7.0000000000000007E-2},{"$f":"'Waste Composition'!G87","v":0.01},{"$f":"'Waste Composition'!H87","v":0},{"$f":"'Waste Composition'!I87","v":0},{"$f":"'Waste Composition'!J87","v":0.08}]
[null,null,null,null,"Comingled Recycling",{"$f":"AC9","v":0.65},null,{"$f":"AD9","v":0.19},null,{"$f":"AE9","v":0},null,{"$f":"AF9","v":7.0000000000000007E-2},null,{"$f":"AG9","v":0.01},null,null,{"$f":"AH9","v":0},null,{"$f":"AI9","v":0},null,null,{"$f":"AJ9","v":0.08},null,null,{"$f":"SUM(F10:W10)","v":1.0000000000000002},null,null,{"$f":"IF(OR(SUM(F10:W10)=1,SUM(F10:W10)=0),TRUE,FALSE)","v":true},{"$f":"'Waste Composition'!C88","v":0.56000000000000005},{"$f":"'Waste Composition'!D88","v":0.39},{"$f":"'Waste Composition'!E88","v":0},{"$f":"'Waste Composition'!F88","v":0.01},{"$f":"'Waste Composition'!G88","v":0},{"$f":"'Waste Composition'!H88","v":0},{"$f":"'Waste Composition'!I88","v":0},{"$f":"'Waste Composition'!J88","v":0.04}]
{"$rows_left_out":22}
{"sheet":"Waste Minimisation","index":4,"n_rows":29,"n_cols":16,"rows_kept":29,"cut":false,"hidden":false,"merged":[[0,2,0,20],[3,2,3,20]]}
[null,null,"School Waste Calculator"]
[null,null,null,null,null,null,null,null,null,null,null,null,null,null,null,"page 5 of 5"]
[]
[null,null,"Waste Minimisation"]
[]
[]
[null,null,null,null,"We recycle printer cartridges. ",null,null,null,null,null,null,false]
[null,null,null,null,"We recycled fluorescent tubes. ",null,null,null,null,null,null,false]
[null,null,null,null,"We recycle computers",null,null,null,null,null,null,false]
[null,null,null,null,"We recycle mobile phones",null,null,null,null,null,null,false]
{"$rows_left_out":20}
{"sheet":"DataStore","index":5,"n_rows":109,"n_cols":10,"rows_kept":109,"cut":false,"hidden":true,"merged":[]}
["School Name",{"$f":"'School Information'!D4","v":0}]
[]
["Number of Students",{"$f":"'School Information'!D6","v":0}]
["Number of Staff",{"$f":"'School Information'!D7","v":0}]
[]
["What State",{"$f":"'School Information'!D9","v":"NSW"}]
["Local Government Area",{"$f":"'School Information'!D10","v":0}]
["Pg2"]
["Number of Reams A4",{"$f":"'Paper purchased'!D6","v":0}]
["Over What Period",{"$f":"'Paper purchased'!D7","v":0}]
{"$rows_left_out":100}
{"sheet":"Additional Constants","index":6,"n_rows":63,"n_cols":18,"rows_kept":63,"cut":false,"hidden":true,"merged":[]}
["State","DR Target","Calculated Diversion Rate"]
["Qld",0.6,null,{"$f":"IF(SUM(DataStore!E14:E66)<>0,(SUM(DataStore!E24:E66)/SUM(DataStore!E14:E66)),0)","v":0},null,null,null,null,null,null,null,null,null,null,null,13089600,60605,{"$f":"P2/Q2","v":215.98217968814456}]
["NSW",0.63,null,null,null,null,null,null,null,null,null,null,null,null,null,1038969400,4810428,{"$f":"P3/Q3","v":215.98273583972153}]
["Vic",0.8]
["SA",0.75,null,null,null,null,null,null,null,null,null,null,null,null,null,17452800,317324,{"$f":"P5/Q5","v":54.999936972936176}]
["WA",0.45,null,null,null,null,null,null,null,null,null,null,null,null,null,546826000,9942291,{"$f":"P6/Q6","v":54.999999497097804}]
["TAS","Not Set",null,null,null,null,null,null,null,null,null,null,null,null,null,1157371600,21043120,{"$f":"P7/Q7","v":55}]
["ACT",0.85,null,null,null,null,null,null,null,null,null,null,null,null,null,29306200,532840,{"$f":"P8/Q8","v":55}]
["NT","Not Set"]
[null,null,null,null,null,null,null,null,null,null,null,null,null,null,null,258878400]
{"$rows_left_out":54}
{"sheet":"Waste Composition","index":7,"n_rows":103,"n_cols":20,"rows_kept":103,"cut":false,"hidden":true,"merged":[[9,9,9,10],[3,2,3,3],[3,4,3,5],[2,6,2,7],[2,9,2,10],[3,6,3,7],[3,9,3,10],[4,2,4,3],[4,4,4,5],[4,6,4,7],[4,9,4,10],[2,2,2,3],[2,4,2,5],[9,2,9,3],[9,4,9,5],[9,6,9,7],[2,11,2,12],[2,14,2,15],[9,11,9,12],[9,14,9,15],[3,11,3,12],[3,14,3,15],[4,11,4,12],[4,14,4,15],[13,11,13,12],[13,14,13,15],[11,2,11,3],[11,4,11,5],[13,2,13,3],[13,4,13,5],[13,6,13,7],[13,9,13,10],[11,6,11,7],[11,9,11,10],[11,11,11,12],[11,14,11,15]]}
["Value",null,"Paper",null,"Cardboard",null,"Containers Bottles and Tubs",null,null,"Food",null,"Garden waste",null,null,"Other Waste"]
[]
[1,"General Waste",0.1,null,0.9,null,0.11,null,null,null,null,0.89,null,null,0.99]
[1,"General Waste",0.1,null,0.9,null,0.11,null,null,null,null,0.89,null,null,0.99]
[1,"General Waste",0.1,null,0.9,null,0.11,null,null,null,null,0.89,null,null,0.99]
[]
[]
[]
[]
[null,"Paper Recycling",1,null,null,null,0.11,null,null,0.79,null,null,null,null,0.99]
{"$rows_left_out":94}
{"sheet":"Recommendation List","index":8,"n_rows":35,"n_cols":9,"rows_kept":35,"cut":false,"hidden":true,"merged":[[1,0,12,0]]}
["Rec Cat","Trigger Description","Trigger formulae","Description",1,"Txt"]
["Waste Generation and Diversion Recommendations","True false based on meters of service identified",{"$f":"IF(DataStore!E44=0,TRUE,FALSE)","v":true},"New services - Commingled Recycling",2,{"$f":"\"As available in \"&H2&\" consider implementing a comingled recycling service.  Comingled recyclables commonly account for 10-20% of a schools normal waste stream and may be recoverable in your area.\"","v":"As available in your local area consider implementing a comingled recycling service.  Comingled recyclables commonly account for 10-20% of a schools normal waste stream and may be recoverable in your area."},null,{"$f":"IF(I2<>0,I2,\"your local area\")","v":"your local area"},{"$f":"'School Information'!D10","v":0}]
[null,"True false based on meters of services (AND) identified",{"$f":"IF(AND(DataStore!E24=0,DataStore!E34=0),TRUE,FALSE)","v":true},"New services - Paper/Cardboard Recycling",3,{"$f":"\"As available in \"&H2&\" consider implementing a paper and cardboard recycling service.  Paper and cardboard recyclables commonly account for approximately 50% of a schools normal waste stream and may be recoverable in your area.\"","v":"As available in your local area consider implementing a paper and cardboard recycling service.  Paper and cardboard recyclables commonly account for approximately 50% of a schools normal waste stream and may be recoverable in your area."}]
[null,"True false based on meters of services (AND) diversion rate",{"$f":"IF(AND(DataStore!E44<>0,'Additional Constants'!D2<0.5),TRUE,FALSE)","v":false},"Additional Service Capacity - Comingled Recycling",4,"Consider increasing you comingled recycling service to improve the diversion of materials from your school.  Diversion rates of >60% should be possible in most schools that have not undertaken programs to eliminate materials that are recyclable through this system."]
[null,"True false based on meters of services (AND) diversion rate",{"$f":"IF(AND(SUM(DataStore!E24,DataStore!E34)<>0,'Additional Constants'!D2<0.5),TRUE,FALSE)","v":false},"Additional Service Capacity - Paper and Cardboard",5,"Consider increasing you paper and/or cardboard services to improve the diversion of materials from your school.  Diversion rates of >60% should be possible in most schools that have not undertaken programs to eliminate materials that are recyclable through this system."]
[null,"True false based service present, less than 50% full and low DR",{"$f":"IF(DataStore!E24<>0,IF(AND(((DataStore!E24/DataStore!F24)<0.51),('Additional Constants'!D2<0.5)),TRUE, FALSE),FALSE)","v":false},"Improved Diversion Paper",6,"Half or less of the capacity of the paper recycling is being used, while the diversion rate of materials away from recycling is low.  Look for ways to improve diversion in this service to maximise your value for money and environmental outcomes."]
[null,"True false based service present, less than 50% full and low DR",{"$f":"IF(DataStore!E34<>0,IF(AND(((DataStore!E34/DataStore!F34)<0.51),('Additional Constants'!D2<0.5)),TRUE, FALSE),FALSE)","v":false},"Improved Diversion Cardboard",7,"Half or less of the capacity of the cardboard recycling is being used, while the diversion rate of materials away from recycling is low.  Look for ways to improve diversion in this service to maximise your value for money and environmental outcomes."]
[null,"True false based service present, less than 50% full and low DR",{"$f":"IF(DataStore!E44<>0,IF(AND(((DataStore!E44/DataStore!F44)<0.51),('Additional Constants'!D2<0.5)),TRUE, FALSE),FALSE)","v":false},"Improved Diversion Comingled",8,"Half or less of the capacity of the comingled recycling is being used, while the diversion rate of materials away from recycling is low.  Look for ways to improve diversion in this service to maximise your value for money and environmental outcomes."]
[null,"False True based on presence of organic diversion services",{"$f":"IF(OR(DataStore!A55=\"Food\",DataStore!A55=\"Garden Waste\",DataStore!A67=\"Food\",DataStore!A67=\"Garden Waste\"),FALSE,TRUE)","v":true},"Introduction of Organic Services",9,"No formal organic diversion services were identified in your responses.  Consider diverting offsite or reusing onsite organic materials such as garden waste or food scraps to reduce the amount of waste generated for disposal from your site."]
[null,"FALSE TRUE based on diversion service considerations",{"$f":"IF(OR(C2,C3,C4,C5,C6,C7,C8,C9=TRUE),FALSE,TRUE)","v":false},"Satisfactory Diversion Services",10,"An examination of the sites diversion services indicates that they are likely to be satisfactory for your sites needs."]
{"$rows_left_out":26}
{"sheet":"Report One","index":9,"n_rows":43,"n_cols":18,"rows_kept":43,"cut":false,"hidden":false,"merged":[[42,7,42,8],[38,9,38,10],[36,3,36,10],[33,8,33,10],[40,7,40,8],[40,3,40,6],[39,3,39,6],[38,7,38,8],[39,7,39,8],[39,9,39,10],[40,9,40,10],[41,9,41,10],[42,9,42,10],[41,7,41,8],[41,3,41,6],[42,3,42,6],[3,3,3,12],[34,3,34,5],[9,3,9,5],[10,3,10,5],[11,3,11,5],[13,3,13,8],[5,3,5,5],[6,3,6,5],[7,3,7,5],[5,6,5,8],[7,6,7,8],[6,6,6,8]]}
[]
[]
[]
[null,null,null,"Summary of Waste Generation"]
[]
[null,null,null,"School Name",null,null,{"$f":"DataStore!B1","v":0},null,null,null,null,null,null,null,null,null,"NEXT"]
[null,null,null,"Local Government Area",null,null,{"$f":"IF(DataStore!B7=0,\"Not Provided\", DataStore!B7)","v":"Not Provided"}]
[null,null,null,"State",null,null,{"$f":"DataStore!B6","v":"NSW"}]
[]
[null,null,null,"Number of Students",null,null,{"$f":"DataStore!B3","v":0}]
{"$rows_left_out":34}
{"sheet":"Report Two","index":10,"n_rows":35,"n_cols":16,"rows_kept":35,"cut":false,"hidden":false,"merged":[[3,3,3,11],[6,3,6,10],[34,3,34,12]]}
[]
[]
[]
[null,null,null,"Impacts of Waste Generation"]
[null,null,null,null,null,null,null,null,null,null,null,null,null,null,null,"NEXT"]
[]
[null,null,null,"How much waste does your school send to landfill?"]
[null,null,null,{"$f":"((D12/45)*240)/('School Information'!D6:N6+'School Information'!D7:N7)","v":{"$error":"#DIV/0!"}},"per person per week (L)"]
[null,null,null,{"$f":"DataStore!E14","v":0},"m3 per week"]
[null,null,null,{"$f":"D12/45","v":0},"wheelie bins per week"]
{"$rows_left_out":26}
{"sheet":"Report Three","index":11,"n_rows":23,"n_cols":21,"rows_kept":23,"cut":false,"hidden":false,"merged":[[3,4,3,15],[7,4,7,6],[7,9,7,11],[6,14,6,16],[12,8,15,12],[12,14,15,16],[5,3,5,6],[5,14,5,16],[5,8,5,12],[6,3,6,6],[6,8,6,12],[12,3,15,6],[9,4,9,6],[10,4,10,6],[11,4,11,6]]}
[]
[]
[]
[null,null,null,null,"Waste Stream Compositions"]
[]
[null,null,null,"General Waste",null,null,null,null,"Comingled Recycling",null,null,null,null,null,"Paper/Cardboard Recycling",null,null,null,null,null,"NEXT"]
[null,null,null,{"$f":"IF('What''s in your waste'!D18=TRUE, \"The general waste stream composition chart represents the composition of your school's waste stream based on the audit data that you have provided.\", \"The general waste stream composition chart represents the composition of your school's waste stream based on average waste stream data for schools.\")","v":"The general waste stream composition chart represents the composition of your school's waste stream based on average waste stream data for schools."},null,null,null,null,{"$f":"IF('What''s in your waste'!D20=TRUE, \"The comingled recycling stream composition chart represents the composition of your school's recycling stream based on the audit data that you have provided.\", \"The comingled recycling stream composition chart represents the composition of your school's recycling stream based on average waste stream data for schools.\")","v":"The comingled recycling stream composition chart represents the composition of your school's recycling stream based on average waste stream data for schools."},null,null,null,null,null,{"$f":"IF('What''s in your waste'!D22=TRUE, \"The paper/cardboard stream composition chart represents the composition of your school's paper/cardboard stream based on the audit data that you have provided.\", \"The paper/cardboard stream composition chart represents the composition of your school's paper/cardboard stream based on average waste stream data for schools.\")","v":"The paper/cardboard stream composition chart represents the composition of your school's paper/cardboard stream based on average waste stream data for schools."}]
[]
[]
[]
{"$rows_left_out":14}
{"sheet":"Report Four","index":12,"n_rows":29,"n_cols":19,"rows_kept":29,"cut":false,"hidden":false,"merged":[[6,6,6,10],[7,6,7,10],[8,6,8,10],[9,6,9,10],[3,3,3,12],[19,6,19,12],[12,6,12,12],[13,6,13,12],[14,6,14,12],[15,6,15,12],[16,6,16,12],[17,6,17,12],[18,6,18,12],[27,5,27,12],[28,5,28,12],[25,5,25,12],[26,5,26,12],[20,6,20,12],[21,6,21,12]]}
[]
[]
[]
[null,null,null,"Waste Minimisation and Avoidance",null,null,null,null,null,null,null,null,null,null,null,null,null,"ü"]
[null,null,null,null,null,null,null,null,null,null,null,null,null,null,null,null,null,"NEXT"]
[null,null,null,"Additional Diversion actions"]
[null,null,null,null,null,{"$f":"IF(DataStore!B89=TRUE,\"ü\",\"û\")","v":"û"},{"$f":"S7&\"recycle printer cartridges\"","v":"No we don't recycle printer cartridges"},null,null,null,null,null,null,null,null,null,null,null,{"$f":"IF(DataStore!B89=TRUE,\"Yes, we \",\"No we don't \")","v":"No we don't "}]
[null,null,null,null,null,{"$f":"IF(DataStore!B90=TRUE,\"ü\",\"û\")","v":"û"},{"$f":"S8&\"recycled fluorescent tubes\"","v":"No we don't recycled fluorescent tubes"},null,null,null,null,null,null,null,null,null,null,null,{"$f":"IF(DataStore!B90=TRUE,\"Yes, we \",\"No we don't \")","v":"No we don't "}]
[null,null,null,null,null,{"$f":"IF(DataStore!B91=TRUE,\"ü\",\"û\")","v":"û"},{"$f":"S9&\"recycle computers\"","v":"No we don't recycle computers"},null,null,null,null,null,null,null,null,null,null,null,{"$f":"IF(DataStore!B91=TRUE,\"Yes, we \",\"No we don't \")","v":"No we don't "}]
[null,null,null,null,null,{"$f":"IF(DataStore!B92=TRUE,\"ü\",\"û\")","v":"û"},{"$f":"S10&\"recycle mobile phones\"","v":"No we don't recycle mobile phones"},null,null,null,null,null,null,null,null,null,null,null,{"$f":"IF(DataStore!B92=TRUE,\"Yes, we \",\"No we don't \")","v":"No we don't "}]
{"$rows_left_out":20}
{"sheet":"Report Five","index":13,"n_rows":31,"n_cols":6,"rows_kept":31,"cut":false,"hidden":false,"merged":[[5,3,5,5],[21,3,21,5],[29,3,29,5],[3,3,3,9]]}
[]
[]
[]
[null,null,null,"Recommendations from Data Provided"]
[]
[null,null,null,"Additional Diversion Services"]
[null,null,null,null,null,{"$f":"IF('Recommendation List'!C10=TRUE,'Recommendation List'!F10,'Recommendation List'!F14)","v":"No Regular Diversion Services Identified"}]
[]
[null,null,null,null,null,{"$f":"IF('Recommendation List'!C3=TRUE,'Recommendation List'!F3,IF('Recommendation List'!C5=TRUE,'Recommendation List'!F5,'Recommendation List'!F26))","v":"As available in your local area consider implementing a paper and cardboard recycling service.  Paper and cardboard recyclables commonly account for approximately 50% of a schools normal waste stream and may be recoverable in your area."}]
[]
{"$rows_left_out":21}